Unnamed: 0,ICU Adm,Age,Sex,Mortality,Thrombolysed,Age.1,Sex.1,APACHE,ICU LOS,Hosp LOS,VFD,Actual VFD,D1,D2,D3,D4,D5,D6,D7,D8,D9,D10,D11,D12,D13,D14,D15,Unnamed: 28,Unnamed: 29,Unnamed: 30,Unnamed: 31,Unnamed: 32,Unnamed: 33,Unnamed: 34,Unnamed: 35,Unnamed: 36,Unnamed: 37,Unnamed: 38,Unnamed: 39,Unnamed: 40
Non-thrombolysed,,,,,,,,,,,,,,,,,,,,,,,,,,,,,,,,,,,,,,,,
57413,10.11,84.0,M,Yes,No,29.0,F,12.0,10.0,11.0,1.0,0.0,13840,20840.0,22320,66600,19700,,,,,,,,,,,,,,,,,,,,,,,
280271,4.Oc,72.0,F,Yes,No,45.0,F,13.0,14.0,16.0,0.0,0.0,11964,1168.0,2520,5500,2900,3720,3420.0,1005.0,1073.0,977.0,,2600.0,3200.0,,,,,,,,,,,,,,,
410711,1.8,61.0,M,Yes,No,54.0,F,8.0,5.0,12.0,3.0,0.0,35450,,44700,Beyond measure,,,,,,,,,,,,,,,,,,,,,,,,
563185,30.7,56.0,M,Yes,No,56.0,M,13.0,16.0,24.0,1.0,0.0,>5250,32760.0,380,5100,3380,3660,3740.0,3840.0,2960.0,2560.0,1170.0,781.0,740.0,,,,,,,,,,,,,,,
590982,18.7,71.0,M,Yes,No,57.0,M,19.0,13.0,15.0,9.0,0.0,197,337.0,,,,502,,454.0,496.0,132.0,9760.0,,,,,,,,,,,,,,,,,
591088,25.7,58.0,M,No,No,57.0,M,4.0,16.0,26.0,2.0,14.0,>5250,3240.0,3630,5040,,,,4700.0,8920.0,14500.0,36600.0,41650.0,12860.0,6300.0,5680.0,4860.0,,,2300.0,,,,1094.0,,,,,
591283,23.7,54.0,M,Yes,No,58.0,M,11.0,8.0,8.0,0.0,0.0,496,,2620,>5250,>5250,>5250,,,,,,,,,,,,,,,,,,,,,,
591881,11.8,71.0,M,No,No,58.0,M,19.0,1.0,10.0,1.0,27.0,4600,,7280,,3840,,,,,,,,,,,,,,,,,,,,,,,
592303,12.8,60.0,F,No,No,60.0,M,11.0,9.0,17.0,1.0,19.0,,,,,,,,,,,,,,7250.0,3180.0,,,,,,,,,,,,,
592601,18.8,29.0,F,No,No,61.0,M,5.0,29.0,40.0,5.0,4.0,10840,5360.0,3740,2980,,3280,7100.0,2840.0,1056.0,999.0,917.0,799.0,781.0,690.0,608.0,529.0,527.0,503.0,386.0,,,,,,,,,
593486,4.9,57.0,M,No,No,71.0,M,8.0,5.0,11.0,3.0,25.0,10880,7000.0,3360,6400,,,755.0,,,398.0,,,,,,,,,,,,,,,,,,
594612,22.9,72.0,M,Yes,No,71.0,M,33.0,5.0,6.0,0.0,0.0,7840,3780.0,,,,,,,,,,,,,,,,,,,,,,,,,,
594740,24.9,71.0,M,Yes,No,71.0,M,17.0,8.0,8.0,1.0,0.0,1071,800.0,883,9940,8920,10580,17740.0,,,,,,,,,,,,,,,,,,,,,
595929,16.10.20,73.0,M,Yes,No,71.0,M,15.0,12.0,17.0,1.0,0.0,292,379.0,799,874,1023,881,3840.0,7900.0,13420.0,14220.0,17800.0,,,,,,,,,,,,,,,,,
596472,22.10.20,58.0,M,No,No,72.0,M,8.0,23.0,33.0,10.0,14.0,3460,5020.0,15880,7360,5200,4300,4160.0,3320.0,914.0,1041.0,,,,,,,,,,,,,,,,,,
596606,25.10.20,81.0,M,Yes,No,72.0,M,19.0,3.0,6.0,0.0,0.0,19460,,,41900,,,,,,,,,,,,,,,,,,,,,,,,
596657,26.10.20,71.0,M,Yes,No,73.0,M,11.0,10.0,13.0,2.0,0.0,47500,58100.0,12240,52500,,12460,,5480.0,7280.0,,,,,,,,,,,,,,,,,,,
596751,27.10.20,57.0,M,Yes,No,74.0,M,11.0,41.0,43.0,0.0,0.0,293,7600.0,,,6420,3680,782.0,,,,,,,,,,,,,,,,,,,,,
596765,27.10.20,45.0,M,No,No,75.0,M,9.0,8.0,11.0,2.0,22.0,Beyond,,Beyond,,11500,6680,,4460.0,,3760.0,2780.0,,,,,,,,,,,,,,,,,
597530,6.11.20,74.0,M,Yes,No,81.0,M,14.0,9.0,9.0,0.0,0.0,320,344.0,,,9860,13180,,,,,,,,,,,,,,,,,,,,,,
598826,30.11.20,75.0,M,Yes,No,84.0,M,10.0,20.0,20.0,0.0,0.0,1104,652.0,39250,Beyond measure,,22420,5520.0,4260.0,4320.0,3300.0,984.0,1039.0,889.0,,,,,,,,,,,,,,,
Total,,1350.0,,,,1350.0,,270.0,265.0,356.0,,,,,,,,,,,,,,,,,,,,,,,,,,,,,,
Avg,,,,,,65.0,,13.0,13.0,15.0,,,,,,,,,,,,,,,,,,,,,,,,,,,,,,
Thrombolysed,,,,,,,,,,,,,,,,,,,,,,,,,,,,,,,,,,,,,,,,
192948,5.8,51.0,F,Yes,Yes,51.0,F,11.0,29.0,40.0,4.0,0.0,5760,8640.0,7360,14380,5260,3400,1168.0,682.0,711.0,618.0,1038.0,1133.0,711.0,1057.0,887.0,845.0,753.0,755.0,1061.0,1010.0,1180.0,919.0,976.0,839.0,770.0,563.0,424.0,435.0
591005,17.7,58.0,M,Yes,Yes,58.0,F,6.0,15.0,15.0,3.0,0.0,225,251.0,1006,3090,2740,5250,5250.0,8170.0,9100.0,,,,,,,,,,,,,,,,,,,
591007,22.7,55.0,M,No,Yes,55.0,M,13.0,9.0,9.0,4.0,23.0,429,,666,2860,858,584,548.0,486.0,,,,,279.0,356.0,,,,,,,,,,,,,,
592354,18.8,61.0,M,No,Yes,61.0,M,9.0,42.0,47.0,17.0,3.0,3280,,11040,18620,11200,42650,20120.0,20800.0,21650.0,10620.0,6940.0,5520.0,9640.0,4360.0,2660.0,1088.0,1018.0,325.0,986.0,869.0,,,,,,,,
594440,18.9,45.0,M,No,Yes,45.0,M,8.0,11.0,20.0,7.0,24.0,12920,15380.0,14740,12980,3880,1018,1035.0,559.0,666.0,586.0,677.0,879.0,373.0,,,,,,,,,,,,,,,
594517,20.9,55.0,M,No,Yes,55.0,M,9.0,6.0,22.0,4.0,26.0,10560,18220.0,5420,2120,1059,676,573.0,529.0,,,294.0,,,,,,610.0,,,,,,,,,,,
594680,25.9,62.0,F,No,Yes,62.0,M,7.0,13.0,25.0,10.0,18.0,2300,11060.0,8580,19640,9620,6520,4440.0,891.0,,,673.0,398.0,,,,,347.0,,,,,,,,,,,
595175,5.10.20,60.0,M,Yes,Yes,60.0,M,10.0,27.0,33.0,3.0,0.0,9260,9100.0,8680,6960,1136,3360,3320.0,1157.0,3040.0,3360.0,5440.0,2680.0,892.0,886.0,848.0,1084.0,1099.0,1068.0,4360.0,924.0,447.0,,,,,,,
595892,10.10.20,49.0,M,No,Yes,49.0,M,13.0,18.0,18.0,9.0,21.0,22750,9540.0,33300,22720,9520,5660,951.0,882.0,769.0,594.0,710.0,514.0,850.0,3320.0,1093.0,744.0,,,,,,,,,,,,
596238,17.10.20,66.0,M,No,Yes,66.0,M,10.0,9.0,16.0,8.0,27.0,14800,16000.0,26800,5840,994,989,2980.0,,,,,,,,,,,,,,,,,,,,,
596765,27.10.20,45.0,M,No,Yes,45.0,M,9.0,8.0,11.0,5.0,25.0,Beyond Measure,11500.0,6680,,4460,,3760.0,2780.0,,,,,,,,,,,,,,,,,,,,
611223,23.4.21,65.0,M,No,Yes,65.0,M,20.0,11.0,15.0,4.0,21.0,4280,13780.0,,17920,,7060,,1071.0,2960.0,,,,,,,,,,,,,,,,,,,
612414,2.5.21,69.0,M,No,Yes,59.0,M,8.0,5.0,10.0,5.0,28.0,49200,46050.0,21750,8420,14480,,,,,,,,,,,,,,,,,,,,,,,
Total,,,,,,562.0,,96.0,179.0,245.0,,,,,,,,,,,,,,,,,,,,,,,,,,,,,,
Avg,,,,,,56.0,,9.0,18.0,20.0,,,,,,,,,,,,,,,,,,,,,,,,,,,,,,
